Articles of osx mavericks

在具有节点npm的OSX Mavericks上安装topojson

我不能得到topojson通过节点npm(使用sudo)在小牛安装。 我已经安装了Xcode命令行工具,并尝试了各种解决scheme,但没有运气。 这是我的输出: > contextify@0.1.6 install /usr/local/lib/node_modules/topojson/node_modules/d3/node_modules/jsdom/node_modules/contextify > node-gyp rebuild CXX(target) Release/obj.target/contextify/src/contextify.o cc1plus: error: unrecognized command line option "-arch" make: *** [Release/obj.target/contextify/src/contextify.o] Error 1 gyp ERR! build error gyp ERR! stack Error: `make` failed with exit code: 2 gyp ERR! stack at ChildProcess.onExit (/usr/local/lib/node_modules/npm/node_modules/node-gyp/lib/build.js:267:23) gyp ERR! stack at ChildProcess.EventEmitter.emit (events.js:98:17) gyp ERR! stack at Process.ChildProcess._handle.onexit […]

NPM无法在OSX 10.9.5上安装zmq

我得到这个错误: /bin/sh: pkg-config: command not found gyp: Call to 'pkg-config libzmq –libs' returned exit status 127. while trying to load binding.gyp 我试过将nodejs升级到5.1.0。 我试过将nodejs降级到4.2.2。 我已经尝试完全删除nodejs手动然后重新安装4.2.2并再次尝试。 我已经尝试删除脚本在这里: https : //gist.github.com/brock/5b1b70590e1171c4ab54 然后重新安装每个版本并再次尝试。 我试过降级到zeromq 4.0.7。 没有运气。 这是完整的错误: localhost:~ user$ npm install zmq / > zmq@2.14.0 install /Users/user/node_modules/zmq > node-gyp rebuild /bin/sh: pkg-config: command not found gyp: Call to 'pkg-config […]

node-opencv / mavericks:dyld:找不到符号

我正在运行一个干净的OSX 10.9安装,并遇到运行node-opencv依赖项的任何node.js应用程序的问题。 我已经通过Homebrew安装了opencv , python , node.js和npm 。 在这种情况下,我试图从示例文件夹中运行: node face_detection.js ,并得到这个错误: dyld: lazy symbol binding failed: Symbol not found: __ZN2cv6imreadERKSsi Referenced from: /Users/Jim/GitHub/node-opencv/build/Release/opencv.node Expected in: dynamic lookup dyld: Symbol not found: __ZN2cv6imreadERKSsi Referenced from: /Users/Jim/GitHub/node-opencv/build/Release/opencv.node Expected in: dynamic lookup Trace/BPT trap: 5

Pow /小牛/ Nack / RBENV / ZSH Somethng不对

我有一个相当多的问题,让pow正常工作。 我正在使用小牛Rbenv ruby​​ 1.9.3p545,pow 0.4.3节点v0.10.26 npm 1.4.7 基本上我想与pow服务的应用程序,不服务。 Chrome和Firefox只是“等待myapp.dev” 查看粉末applog – 尾巴日志,说所有的请求正在进行,并显示输出几乎相同的轨道s(其工作),除了两条线关于SSL的Api调用 rails的工作正常的应用程序。 小牛parsing器说开发者在那里。 去localhost显示默认的电源屏幕,就像它运行。 创build一个全新的铁路应用程序工作,并提供默认的轨道页面。 Pow / accesslog有一个正常的GET请求。 Pow / apps / myapp.log有 – WARNING /usr/local/lib/node_modules/pow/node_modules/nack/lib/nack/server.rb:66:in `unlink': No such file or directory – /tmp/nack.6042.2652029974.sock (Errno::ENOENT) [Fri Apr 25 2014 11:21:02 GMT+0100 (BST)] WARNING from /usr/local/lib/node_modules/pow/node_modules/nack/lib/nack/server.rb:66:in `close' [Fri Apr 25 2014 11:21:02 GMT+0100 (BST)] WARNING […]

使用NPM安装包会导致依赖性循环

基本信息: System: OS X 10.9.2 Npm version: 1.4.9 Node version: v0.10.28 Ruby Version : ruby ​2.1.1p76 ( 2/24/2014 Revision 45161 ) [ x86_64- darwin12.0 ] 发生什么事情是,当我运行npm install -g bower或者sudo nom install -g命令或者bower变成了一个有错误但未完成的循环时,执行回滚并重新启动(我猜)。 也恰好被设置为下载其他依赖,如karma , mocha , chai (我不知道是否会成为bower依赖关系),但问题不仅在于,而且恰巧试图安装任何依赖关系考试: yeoman , grunt等… 我试过下面的命令,但问题依然存在: npm cache clean npm cache clear 这是一个部分 – debug.log npm文件: 32016 verbose etag […]

npm ERR! 无效:strip-ansi@0.2.2

使用brew upgrade node : $ node -v v0.10.30 我做了一个npm update -g : $ npm -v 1.4.23 当npm ls -g时有一个ERR: npm ERR! invalid: strip-ansi@0.2.2 /usr/local/lib/node_modules/npm/node_modules/columnify/node_modules/strip-ansi npm ERR! not ok code 0 我该如何解决这个错误?

无法从本地networking上的不同设备访问Mac上的节点服务器

我使用OS X 10.9在我的Mac上运行节点服务器。这里是代码 var http = require('http'); http.createServer(function (request, response) { response.writeHead(200, {'Content-Type': 'text/plain'}); response.end('Hello World\n'); }).listen(3000, '0.0.0.0'); console.log('Server running at http://192.168.1.120:3000/'); 我可以在我的Mac上使用Safari访问http://192.168.1.120:3000/服务器。 但是,当我用我的iPhone访问服务器,它失败了。 我的Mac的防火墙closures了,我的iPhone和Mac一样都在同一个WiFi上。

当试图configuration或重buildnode-gyp时,出现错误:mac osx mavericks

我正在尝试运行node-gyp configure ,但遇到以下错误: gyp: binding.gyp not found (cwd: /usr/local/bin) gyp ERR! configure error gyp ERR! stack Error: `gyp` failed with exit code: 1 gyp ERR! stack at ChildProcess.onCpExit (/usr/local/lib/node_modules/node-gyp/lib/configure.js:337:16) gyp ERR! stack at ChildProcess.EventEmitter.emit (events.js:98:17) gyp ERR! stack at Process.ChildProcess._handle.onexit (child_process.js:789:12) gyp ERR! System Darwin 13.0.0 gyp ERR! command "node" "/usr/local/bin/node-gyp" "configure" gyp ERR! cwd […]